{"text_format":"1","workbook":"xlsx","n_sheets":2,"sheets":["様式第1-6号","地域活動指針（資源向上・長寿命化）"],"not_rendered":{"charts":0,"images":0,"macros":1,"external_links":0,"defined_names":3,"comments":0,"pivot_tables":0},"unopened":[],"bounds":{"document_bytes":16777216,"sheet_cells":100000,"rows_first":2000,"rows_last":500,"rows_between":2000,"halvings":0,"cell_chars":16384,"cell_head_chars":4096},"cells_cut":0,"cells_raw":0,"read":"whole","date_system":"1900"}

{"sheet":"様式第1-6号","index":0,"n_rows":597,"n_cols":45,"rows_kept":597,"cut":false,"hidden":false,"merged":[[513,15,515,15],[516,16,518,16],[513,17,515,17],[513,18,515,18],[513,19,515,19],[513,30,515,30],[513,31,515,31],[513,32,515,32],[513,33,515,33],[513,34,515,34],[516,17,518,17],[516,18,518,18],[516,19,518,19],[516,30,518,30],[516,31,518,31],[516,32,518,32],[516,33,518,33],[516,34,518,34],[513,16,515,16],[510,34,512,34],[516,0,518,0],[516,1,518,1],[516,2,518,2],[516,3,518,3],[516,4,518,4],[516,5,518,5],[516,6,518,6],[516,7,518,7],[516,8,518,8],[516,9,518,9],[516,10,518,10],[516,11,518,11],[516,12,518,12],[516,13,518,13],[516,14,518,14],[516,15,518,15],[513,0,515,0],[513,1,515,1],[513,2,515,2],[513,3,515,3],[513,4,515,4],[513,5,515,5],[513,6,515,6],[513,7,515,7],[513,8,515,8],[513,9,515,9],[513,10,515,10],[513,11,515,11],[513,12,515,12],[513,13,515,13],[513,14,515,14],[507,17,509,17],[507,18,509,18],[507,19,509,19],[507,30,509,30],[507,31,509,31],[507,32,509,32],[507,33,509,33],[507,34,509,34],[510,18,512,18],[510,0,512,0],[510,1,512,1],[510,2,512,2],[510,3,512,3],[510,4,512,4],[510,5,512,5],[510,6,512,6],[510,7,512,7],[510,8,512,8],[510,9,512,9],[510,10,512,10],[510,11,512,11],[510,12,512,12],[510,13,512,13],[510,14,512,14],[510,15,512,15],[510,16,512,16],[510,17,512,17],[510,19,512,19],[510,30,512,30],[510,31,512,31],[510,32,512,32],[510,33,512,33],[507,0,509,0],[507,1,509,1],[507,2,509,2],[507,3,509,3],[507,4,509,4],[507,5,509,5],[507,6,509,6],[507,7,509,7],[507,8,509,8],[507,9,509,9],[507,10,509,10],[507,11,509,11],[507,12,509,12],[507,13,509,13],[507,14,509,14],[507,15,509,15],[507,16,509,16],[501,34,503,34],[504,0,506,0],[504,1,506,1],[504,2,506,2],[504,3,506,3],[504,4,506,4],[504,5,506,5],[504,6,506,6],[504,7,506,7],[504,8,506,8],[504,9,506,9],[504,10,506,10],[504,11,506,11],[504,12,506,12],[504,13,506,13],[504,14,506,14],[504,15,506,15],[504,16,506,16],[504,17,506,17],[504,18,506,18],[504,19,506,19],[504,30,506,30],[504,31,506,31],[504,32,506,32],[504,33,506,33],[504,34,506,34],[498,17,500,17],[498,18,500,18],[498,19,500,19],[498,30,500,30],[498,31,500,31],[498,32,500,32],[498,33,500,33],[498,34,500,34],[501,0,503,0],[501,1,503,1],[501,2,503,2],[501,3,503,3],[501,4,503,4],[501,5,503,5],[501,6,503,6],[501,7,503,7],[501,8,503,8],[501,9,503,9],[501,10,503,10],[501,11,503,11],[501,12,503,12],[501,13,503,13],[501,14,503,14],[501,15,503,15],[501,16,503,16],[501,17,503,17],[501,18,503,18],[501,19,503,19],[501,30,503,30],[501,31,503,31],[501,32,503,32],[501,33,503,33],[498,0,500,0],[498,1,500,1],[498,2,500,2],[498,3,500,3],[498,4,500,4],[498,5,500,5],[498,6,500,6],[498,7,500,7],[498,8,500,8],[498,9,500,9],[498,10,500,10],[498,11,500,11],[498,12,500,12],[498,13,500,13],[498,14,500,14],[498,15,500,15],[498,16,500,16],[492,34,494,34],[495,12,497,12],[495,13,497,13],[495,14,497,14],[495,15,497,15],[495,0,497,0],[495,1,497,1],[495,2,497,2],[495,3,497,3],[495,4,497,4],[495,5,497,5],[495,6,497,6],[495,7,497,7],[495,8,497,8],[495,9,497,9],[495,10,497,10],[495,11,497,11],[495,16,497,16],[495,17,497,17],[495,18,497,18],[495,19,497,19],[495,30,497,30],[495,31,497,31],[495,32,497,32],[495,33,497,33],[495,34,497,34],[489,17,491,17],[489,18,491,18],[489,19,491,19],[489,30,491,30],[489,31,491,31],[489,32,491,32],[489,33,491,33],[489,34,491,34],[492,0,494,0],[492,1,494,1],[492,2,494,2],[492,3,494,3],[492,4,494,4],[492,5,494,5],[492,6,494,6],[492,7,494,7],[492,8,494,8],[492,9,494,9],[492,10,494,10],[492,11,494,11],[492,12,494,12],[492,13,494,13],[492,14,494,14],[492,15,494,15],[492,16,494,16],[492,17,494,17],[492,18,494,18],[492,19,494,19],[492,30,494,30],[492,31,494,31],[492,32,494,32],[492,33,494,33],[489,0,491,0],[489,1,491,1],[489,2,491,2],[489,3,491,3],[489,4,491,4],[489,5,491,5],[489,6,491,6],[489,7,491,7],[489,8,491,8],[489,9,491,9],[489,10,491,10],[489,11,491,11],[489,12,491,12],[489,13,491,13],[489,14,491,14],[489,15,491,15],[489,16,491,16],[483,34,485,34],[486,0,488,0],[486,1,488,1],[486,2,488,2],[486,3,488,3],[486,4,488,4],[486,5,488,5],[486,6,488,6],[486,7,488,7],[486,8,488,8],[486,9,488,9],[486,10,488,10],[486,11,488,11],[486,12,488,12],[486,13,488,13],[486,14,488,14],[486,15,488,15],[486,16,488,16],[486,17,488,17],[486,18,488,18],[486,19,488,19],[486,30,488,30],[486,31,488,31],[486,32,488,32],[486,33,488,33],[486,34,488,34],[480,17,482,17],[480,18,482,18],[480,19,482,19],[480,30,482,30],[480,31,482,31],[480,32,482,32],[480,33,482,33],[480,34,482,34],[483,0,485,0],[483,1,485,1],[483,2,485,2],[483,3,485,3],[483,4,485,4],[483,5,485,5],[483,6,485,6],[483,7,485,7],[483,8,485,8],[483,9,485,9],[483,10,485,10],[483,11,485,11],[483,12,485,12],[483,13,485,13],[483,14,485,14],[483,15,485,15],[483,16,485,16],[483,17,485,17],[483,18,485,18],[483,19,485,19],[483,30,485,30],[483,31,485,31],[483,32,485,32],[483,33,485,33],[480,0,482,0],[480,1,482,1],[480,2,482,2],[480,3,482,3],[480,4,482,4],[480,5,482,5],[480,6,482,6],[480,7,482,7],[480,8,482,8],[480,9,482,9],[480,10,482,10],[480,11,482,11],[480,12,482,12],[480,13,482,13],[480,14,482,14],[480,15,482,15],[480,16,482,16],[474,34,476,34],[477,12,479,12],[477,13,479,13],[477,14,479,14],[477,15,479,15],[477,0,479,0],[477,1,479,1],[477,2,479,2],[477,3,479,3],[477,4,479,4],[477,5,479,5],[477,6,479,6],[477,7,479,7],[477,8,479,8],[477,9,479,9],[477,10,479,10],[477,11,479,11],[477,16,479,16],[477,17,479,17],[477,18,479,18],[477,19,479,19],[477,30,479,30],[477,31,479,31],[477,32,479,32],[477,33,479,33],[477,34,479,34],[471,17,473,17],[471,18,473,18],[471,19,473,19],[471,30,473,30],[471,31,473,31],[471,32,473,32],[471,33,473,33],[471,34,473,34],[474,0,476,0],[474,1,476,1],[474,2,476,2],[474,3,476,3],[474,4,476,4],[474,5,476,5],[474,6,476,6],[474,7,476,7],[474,8,476,8],[474,9,476,9],[474,10,476,10],[474,11,476,11],[474,12,476,12],[474,13,476,13],[474,14,476,14],[474,15,476,15],[474,16,476,16],[474,17,476,17],[474,18,476,18],[474,19,476,19],[474,30,476,30],[474,31,476,31],[474,32,476,32],[474,33,476,33],[471,0,473,0],[471,1,473,1],[471,2,473,2],[471,3,473,3],[471,4,473,4],[471,5,473,5],[471,6,473,6],[471,7,473,7],[471,8,473,8],[471,9,473,9],[471,10,473,10],[471,11,473,11],[471,12,473,12],[471,13,473,13],[471,14,473,14],[471,15,473,15],[471,16,473,16],[465,34,467,34],[468,0,470,0],[468,1,470,1],[468,2,470,2],[468,3,470,3],[468,4,470,4],[468,5,470,5],[468,6,470,6],[468,7,470,7],[468,8,470,8],[468,9,470,9],[468,10,470,10],[468,11,470,11],[468,12,470,12],[468,13,470,13],[468,14,470,14],[468,15,470,15],[468,16,470,16],[468,17,470,17],[468,18,470,18],[468,19,470,19],[468,30,470,30],[468,31,470,31],[468,32,470,32],[468,33,470,33],[468,34,470,34],[462,17,464,17],[462,18,464,18],[462,19,464,19],[462,30,464,30],[462,31,464,31],[462,32,464,32],[462,33,464,33],[462,34,464,34],[465,0,467,0],[465,1,467,1],[465,2,467,2],[465,3,467,3],[465,4,467,4],[465,5,467,5],[465,6,467,6],[465,7,467,7],[465,8,467,8],[465,9,467,9],[465,10,467,10],[465,11,467,11],[465,12,467,12],[465,13,467,13],[465,14,467,14],[465,15,467,15],[465,16,467,16],[465,17,467,17],[465,18,467,18],[465,19,467,19],[465,30,467,30],[465,31,467,31],[465,32,467,32],[465,33,467,33],[462,0,464,0],[462,1,464,1],[462,2,464,2],[462,3,464,3],[462,4,464,4],[462,5,464,5],[462,6,464,6],[462,7,464,7],[462,8,464,8],[462,9,464,9],[462,10,464,10],[462,11,464,11],[462,12,464,12],[462,13,464,13],[462,14,464,14],[462,15,464,15],[462,16,464,16],[456,34,458,34],[459,12,461,12],[459,13,461,13],[459,14,461,14],[459,15,461,15],[459,0,461,0],[459,1,461,1],[459,2,461,2],[459,3,461,3],[459,4,461,4],[459,5,461,5],[459,6,461,6],[459,7,461,7],[459,8,461,8],[459,9,461,9],[459,10,461,10],[459,11,461,11],[459,16,461,16],[459,17,461,17],[459,18,461,18],[459,19,461,19],[459,30,461,30],[459,31,461,31],[459,32,461,32],[459,33,461,33],[459,34,461,34],[453,17,455,17],[453,18,455,18],[453,19,455,19],[453,30,455,30],[453,31,455,31],[453,32,455,32],[453,33,455,33],[453,34,455,34],[456,0,458,0],[456,1,458,1],[456,2,458,2],[456,3,458,3],[456,4,458,4],[456,5,458,5],[456,6,458,6],[456,7,458,7],[456,8,458,8],[456,9,458,9],[456,10,458,10],[456,11,458,11],[456,12,458,12],[456,13,458,13],[456,14,458,14],[456,15,458,15],[456,16,458,16],[456,17,458,17],[456,18,458,18],[456,19,458,19],[456,30,458,30],[456,31,458,31],[456,32,458,32],[456,33,458,33],[453,0,455,0],[453,1,455,1],[453,2,455,2],[453,3,455,3],[453,4,455,4],[453,5,455,5],[453,6,455,6],[453,7,455,7],[453,8,455,8],[453,9,455,9],[453,10,455,10],[453,11,455,11],[453,12,455,12],[453,13,455,13],[453,14,455,14],[453,15,455,15],[453,16,455,16],[447,34,449,34],[450,0,452,0],[450,1,452,1],[450,2,452,2],[450,3,452,3],[450,4,452,4],[450,5,452,5],[450,6,452,6],[450,7,452,7],[450,8,452,8],[450,9,452,9],[450,10,452,10],[450,11,452,11],[450,12,452,12],[450,13,452,13],[450,14,452,14],[450,15,452,15],[450,16,452,16],[450,17,452,17],[450,18,452,18],[450,19,452,19],[450,30,452,30],[450,31,452,31],[450,32,452,32],[450,33,452,33],[450,34,452,34],[444,17,446,17],[444,18,446,18],[444,19,446,19],[444,30,446,30],[444,31,446,31],[444,32,446,32],[444,33,446,33],[444,34,446,34],[447,0,449,0],[447,1,449,1],[447,2,449,2],[447,3,449,3],[447,4,449,4],[447,5,449,5],[447,6,449,6],[447,7,449,7],[447,8,449,8],[447,9,449,9],[447,10,449,10],[447,11,449,11],[447,12,449,12],[447,13,449,13],[447,14,449,14],[447,15,449,15],[447,16,449,16],[447,17,449,17],[447,18,449,18],[447,19,449,19],[447,30,449,30],[447,31,449,31],[447,32,449,32],[447,33,449,33],[444,0,446,0],[444,1,446,1],[444,2,446,2],[444,3,446,3],[444,4,446,4],[444,5,446,5],[444,6,446,6],[444,7,446,7],[444,8,446,8],[444,9,446,9],[444,10,446,10],[444,11,446,11],[444,12,446,12],[444,13,446,13],[444,14,446,14],[444,15,446,15],[444,16,446,16],[438,34,440,34],[441,12,443,12],[441,13,443,13],[441,14,443,14],[441,15,443,15],[441,0,443,0],[441,1,443,1],[441,2,443,2],[441,3,443,3],[441,4,443,4],[441,5,443,5],[441,6,443,6],[441,7,443,7],[441,8,443,8],[441,9,443,9],[441,10,443,10],[441,11,443,11],[441,16,443,16],[441,17,443,17],[441,18,443,18],[441,19,443,19],[441,30,443,30],[441,31,443,31],[441,32,443,32],[441,33,443,33],[441,34,443,34],[435,17,437,17],[435,18,437,18],[435,19,437,19],[435,30,437,30],[435,31,437,31],[435,32,437,32],[435,33,437,33],[435,34,437,34],[438,0,440,0],[438,1,440,1],[438,2,440,2],[438,3,440,3],[438,4,440,4],[438,5,440,5],[438,6,440,6],[438,7,440,7],[438,8,440,8],[438,9,440,9],[438,10,440,10],[438,11,440,11],[438,12,440,12],[438,13,440,13],[438,14,440,14],[438,15,440,15],[438,16,440,16],[438,17,440,17],[438,18,440,18],[438,19,440,19],[438,30,440,30],[438,31,440,31],[438,32,440,32],[438,33,440,33],[435,0,437,0],[435,1,437,1],[435,2,437,2],[435,3,437,3],[435,4,437,4],[435,5,437,5],[435,6,437,6],[435,7,437,7],[435,8,437,8],[435,9,437,9],[435,10,437,10],[435,11,437,11],[435,12,437,12],[435,13,437,13],[435,14,437,14],[435,15,437,15],[435,16,437,16],[429,34,431,34],[432,0,434,0],[432,1,434,1],[432,2,434,2],[432,3,434,3],[432,4,434,4],[432,5,434,5],[432,6,434,6],[432,7,434,7],[432,8,434,8],[432,9,434,9],[432,10,434,10],[432,11,434,11],[432,12,434,12],[432,13,434,13],[432,14,434,14],[432,15,434,15],[432,16,434,16],[432,17,434,17],[432,18,434,18],[432,19,434,19],[432,30,434,30],[432,31,434,31],[432,32,434,32],[432,33,434,33],[432,34,434,34],[426,17,428,17],[426,18,428,18],[426,19,428,19],[426,30,428,30],[426,31,428,31],[426,32,428,32],[426,33,428,33],[426,34,428,34],[429,0,431,0],[429,1,431,1],[429,2,431,2],[429,3,431,3],[429,4,431,4],[429,5,431,5],[429,6,431,6],[429,7,431,7],[429,8,431,8],[429,9,431,9],[429,10,431,10],[429,11,431,11],[429,12,431,12],[429,13,431,13],[429,14,431,14],[429,15,431,15],[429,16,431,16],[429,17,431,17],[429,18,431,18],[429,19,431,19],[429,30,431,30],[429,31,431,31],[429,32,431,32],[429,33,431,33],[426,0,428,0],[426,1,428,1],[426,2,428,2],[426,3,428,3],[426,4,428,4],[426,5,428,5],[426,6,428,6],[426,7,428,7],[426,8,428,8],[426,9,428,9],[426,10,428,10],[426,11,428,11],[426,12,428,12],[426,13,428,13],[426,14,428,14],[426,15,428,15],[426,16,428,16],[420,19,422,19],[420,30,422,30],[420,34,422,34],[420,31,422,31],[420,32,422,32],[420,33,422,33],[423,12,425,12],[423,13,425,13],[423,14,425,14],[423,15,425,15],[423,0,425,0],[423,1,425,1],[423,2,425,2],[423,3,425,3],[423,4,425,4],[423,5,425,5],[423,6,425,6],[423,7,425,7],[423,8,425,8],[423,9,425,9],[423,10,425,10],[423,11,425,11],[423,16,425,16],[423,17,425,17],[423,18,425,18],[423,19,425,19],[423,30,425,30],[423,31,425,31],[423,32,425,32],[423,33,425,33],[423,34,425,34],[417,17,419,17],[417,18,419,18],[417,14,419,14],[417,15,419,15],[417,16,419,16],[417,19,419,19],[417,30,419,30],[417,31,419,31],[411,6,413,6],[411,7,413,7],[417,32,419,32],[417,33,419,33],[417,34,419,34],[420,0,422,0],[420,1,422,1],[420,2,422,2],[420,3,422,3],[420,4,422,4],[420,5,422,5],[420,6,422,6],[420,7,422,7],[420,8,422,8],[420,9,422,9],[420,10,422,10],[420,11,422,11],[420,12,422,12],[420,13,422,13],[420,14,422,14],[420,15,422,15],[420,16,422,16],[420,17,422,17],[420,18,422,18],[417,0,419,0],[417,1,419,1],[417,2,419,2],[417,3,419,3],[417,4,419,4],[417,5,419,5],[417,6,419,6],[417,7,419,7],[417,8,419,8],[417,9,419,9],[417,10,419,10],[417,11,419,11],[417,12,419,12],[417,13,419,13],[414,6,416,6],[414,7,416,7],[414,8,416,8],[414,9,416,9],[414,10,416,10],[414,11,416,11],[282,31,284,31],[348,31,350,31],[351,31,353,31],[363,31,365,31],[366,31,368,31],[249,31,251,31],[252,31,254,31],[255,31,257,31],[258,31,260,31],[261,31,263,31],[288,31,290,31],[291,31,293,31],[303,31,305,31],[306,31,308,31],[369,31,371,31],[372,31,374,31],[375,31,377,31],[369,16,371,16],[369,17,371,17],[363,18,365,18],[402,31,404,31],[405,31,407,31],[195,31,197,31],[198,31,200,31],[201,31,203,31],[267,31,269,31],[222,31,224,31],[225,31,227,31],[228,31,230,31],[231,31,233,31],[243,31,245,31],[246,31,248,31],[366,30,368,30],[345,17,347,17],[339,31,341,31],[318,17,320,17],[318,18,320,18],[318,19,320,19],[318,30,320,30],[312,18,314,18],[312,19,314,19],[312,30,314,30],[288,30,290,30],[294,19,296,19],[309,31,311,31],[312,31,314,31],[315,31,317,31],[318,31,320,31],[321,31,323,31],[162,31,164,31],[129,31,131,31],[132,31,134,31],[135,31,137,31],[138,31,140,31],[141,31,143,31],[144,31,146,31],[168,31,170,31],[171,31,173,31],[183,31,185,31],[186,31,188,31],[105,31,107,31],[108,31,110,31],[111,31,113,31],[123,31,125,31],[126,31,128,31],[15,31,17,31],[60,31,62,31],[87,31,89,31],[90,31,92,31],[81,31,83,31],[7,31,7,34],[18,31,20,31],[21,31,23,31],[24,31,26,31],[27,31,29,31],[15,33,17,33],[15,34,17,34],[30,31,32,31],[33,31,35,31],[36,31,38,31],[39,31,41,31],[42,31,44,31],[45,31,47,31],[48,31,50,31],[51,31,53,31],[54,31,56,31],[57,31,59,31],[33,34,35,34],[54,34,56,34],[39,32,41,32],[39,33,41,33],[30,32,32,32],[9,34,11,34],[12,33,14,33],[12,34,14,34],[60,34,62,34],[42,34,44,34],[39,34,41,34],[30,34,32,34],[24,34,26,34],[21,33,23,33],[21,34,23,34],[24,32,26,32],[24,33,26,33],[27,33,29,33],[27,34,29,34],[36,34,38,34],[33,32,35,32],[414,34,416,34],[414,12,416,12],[414,13,416,13],[414,14,416,14],[414,15,416,15],[414,16,416,16],[414,17,416,17],[411,19,413,19],[405,17,407,17],[402,32,404,32],[402,33,404,33],[402,34,404,34],[405,33,407,33],[402,12,404,12],[402,13,404,13],[402,14,404,14],[402,15,404,15],[402,16,404,16],[396,30,398,30],[411,30,413,30],[411,32,413,32],[411,33,413,33],[411,34,413,34],[411,12,413,12],[411,13,413,13],[411,14,413,14],[411,15,413,15],[411,16,413,16],[411,17,413,17],[414,31,416,31],[411,0,413,0],[411,1,413,1],[411,2,413,2],[411,3,413,3]],"merged_total":4270,"flags":["merged_cut"]}
[]
[]
[]
[]
["（様式第１－６号）"]
[null,null,null,null,null,null,null,null,null,null,null,null,null,null,null,null,"平成",null,null,null,"年度　　　多面的機能支払交付金　　　活動記録"]
[null,null,null,null,null,null,null,null,null,null,null,null,null,null,null,null,null,null,null,null,"【 資源向上支払（施設の長寿命化）】"]
[null,null,null,null,null,null,null,null,null,null,null,null,null,null,null,null,null,null,null,null,null,null,null,null,null,null,null,null,null,null,"組織名"]
[]
["活動実施日時",null,null,null,null,null,null,null,null,null,null,null,null,null,"活動参加人数",null,null,null,null,null,"活動内容",null,null,null,null,null,null,null,null,null,null,null,null,null,"備考\n（活動の詳細、場所等）"]
["実施月日","実施時間",null,null,null,null,null,null,null,null,null,null,null,null,"総参加\n人　数",null,"農業者",null,"農業者\n以　外",null,"活動区分",null,null,null,null,null,null,null,null,null,"施設","活動\n番号","具体的な活動内容"]
[null,"時間帯",null,null,null,null,null,null,null,null,"実施時間",null,null,null,null,null,null,null,null,null,null,null,null,null,null,null,null,null,null,null,null,null,"対象活動","取組内容"]
[null,null,"時",null,"分","～",null,"時",null,"分",{"$f":"+IF(AND(ISNUMBER(B13),ISNUMBER(G13),INT((G13-B13)+(I13-D13)/60)>=0),INT((G13-B13)+(I13-D13)/60),\"\")","v":""},"時間",{"$f":"IF(AND(ISNUMBER(D13),ISNUMBER(I13)),ABS(D13-I13),\"\")","v":""},"分",{"$f":"IF(Q13+S13=0,\"\",Q13+S13)","v":""},"人",null,"人",null,"人","☐","農地維持","☐","資源向上(共同)","☐","調査・計画","☐","実践活動","☐","事務処理等",null,null,{"$f":"IF(ISNUMBER(AF13),VLOOKUP(AF13,$AQ$548:$AR$597,2,0),\"\")","v":""},null,null,"← 会議等で、活動項目と取組に［－」を記入\n　　するときは、活動番号に「0」を入力する。",{"$f":"IF(AND(ISBLANK(A13),ISBLANK(B13),ISBLANK(D13),ISBLANK(G13),ISBLANK(I13),ISBLANK(Q13),ISBLANK(S13),ISBLANK(AE13),ISBLANK(AF13),ISBLANK(AH13),ISBLANK(AI13)),1,\"\")","v":1}]
[null,null,null,null,null,null,null,null,null,null,null,null,null,null,null,null,null,null,null,null,"☐","資源向上(長寿命化)","☐","広域化・体制強化",null,null,"☐","啓発・普及","☐","研修・会議",null,null,null,null,null,null,{"$f":"IF(AND(ISBLANK(A13),ISBLANK(B13),ISBLANK(D13),ISBLANK(G13),ISBLANK(I13),ISBLANK(Q13),ISBLANK(S13),ISBLANK(AE13),ISBLANK(AF13),ISBLANK(AH13),ISBLANK(AI13)),1,\"\")","v":1}]
[null,null,null,null,null,null,null,null,null,null,null,null,null,null,null,null,null,null,null,null,"☐","資源保全プラン","☐","特例措置を適用した活動",null,null,"☐","設置等","☐","発注事務",null,null,null,null,null,null,{"$f":"IF(AND(ISBLANK(A13),ISBLANK(B13),ISBLANK(D13),ISBLANK(G13),ISBLANK(I13),ISBLANK(Q13),ISBLANK(S13),ISBLANK(AE13),ISBLANK(AF13),ISBLANK(AH13),ISBLANK(AI13)),1,\"\")","v":1}]
[null,null,"時",null,"分","～",null,"時",null,"分",{"$f":"+IF(AND(ISNUMBER(B16),ISNUMBER(G16),INT((G16-B16)+(I16-D16)/60)>=0),INT((G16-B16)+(I16-D16)/60),\"\")","v":""},"時間",{"$f":"IF(AND(ISNUMBER(D16),ISNUMBER(I16)),ABS(D16-I16),\"\")","v":""},"分",{"$f":"IF(Q16+S16=0,\"\",Q16+S16)","v":""},"人",null,"人",null,"人","☐","農地維持","☐","資源向上(共同)","☐","調査・計画","☐","実践活動","☐","事務処理等",null,null,{"$f":"IF(ISNUMBER(AF16),VLOOKUP(AF16,$AQ$548:$AR$597,2,0),\"\")","v":""},null,null,null,{"$f":"IF(AND(ISBLANK(A16),ISBLANK(B16),ISBLANK(D16),ISBLANK(G16),ISBLANK(I16),ISBLANK(Q16),ISBLANK(S16),ISBLANK(AE16),ISBLANK(AF16),ISBLANK(AH16),ISBLANK(AI16)),1,\"\")","v":1}]
[null,null,null,null,null,null,null,null,null,null,null,null,null,null,null,null,null,null,null,null,"☐","資源向上(長寿命化)","☐","広域化・体制強化",null,null,"☐","啓発・普及","☐","研修・会議",null,null,null,null,null,null,{"$f":"IF(AND(ISBLANK(A16),ISBLANK(B16),ISBLANK(D16),ISBLANK(G16),ISBLANK(I16),ISBLANK(Q16),ISBLANK(S16),ISBLANK(AE16),ISBLANK(AF16),ISBLANK(AH16),ISBLANK(AI16)),1,\"\")","v":1}]
[null,null,null,null,null,null,null,null,null,null,null,null,null,null,null,null,null,null,null,null,"☐","資源保全プラン","☐","特例措置を適用した活動",null,null,"☐","設置等","☐","発注事務",null,null,null,null,null,null,{"$f":"IF(AND(ISBLANK(A16),ISBLANK(B16),ISBLANK(D16),ISBLANK(G16),ISBLANK(I16),ISBLANK(Q16),ISBLANK(S16),ISBLANK(AE16),ISBLANK(AF16),ISBLANK(AH16),ISBLANK(AI16)),1,\"\")","v":1}]
[null,null,"時",null,"分","～",null,"時",null,"分",{"$f":"+IF(AND(ISNUMBER(B19),ISNUMBER(G19),INT((G19-B19)+(I19-D19)/60)>=0),INT((G19-B19)+(I19-D19)/60),\"\")","v":""},"時間",{"$f":"IF(AND(ISNUMBER(D19),ISNUMBER(I19)),ABS(D19-I19),\"\")","v":""},"分",{"$f":"IF(Q19+S19=0,\"\",Q19+S19)","v":""},"人",null,"人",null,"人","☐","農地維持","☐","資源向上(共同)","☐","調査・計画","☐","実践活動","☐","事務処理等",null,null,{"$f":"IF(ISNUMBER(AF19),VLOOKUP(AF19,$AQ$548:$AR$597,2,0),\"\")","v":""},null,null,null,{"$f":"IF(AND(ISBLANK(A19),ISBLANK(B19),ISBLANK(D19),ISBLANK(G19),ISBLANK(I19),ISBLANK(Q19),ISBLANK(S19),ISBLANK(AE19),ISBLANK(AF19),ISBLANK(AH19),ISBLANK(AI19)),1,\"\")","v":1}]
[null,null,null,null,null,null,null,null,null,null,null,null,null,null,null,null,null,null,null,null,"☐","資源向上(長寿命化)","☐","広域化・体制強化",null,null,"☐","啓発・普及","☐","研修・会議",null,null,null,null,null,null,{"$f":"IF(AND(ISBLANK(A19),ISBLANK(B19),ISBLANK(D19),ISBLANK(G19),ISBLANK(I19),ISBLANK(Q19),ISBLANK(S19),ISBLANK(AE19),ISBLANK(AF19),ISBLANK(AH19),ISBLANK(AI19)),1,\"\")","v":1}]
{"$rows_left_out":578}
{"sheet":"地域活動指針（資源向上・長寿命化）","index":1,"n_rows":53,"n_cols":8,"rows_kept":53,"cut":false,"hidden":false,"merged":[[0,0,0,4],[19,2,27,2],[8,2,9,2],[10,1,27,1],[10,2,18,2],[3,0,3,1],[3,2,3,3],[4,0,27,0],[4,1,9,1],[4,2,7,2],[28,0,35,0],[28,1,32,1],[28,2,29,2],[30,2,32,2],[33,1,35,1],[34,2,35,2],[45,0,52,1],[49,2,52,2],[38,2,40,2],[41,2,44,2],[45,2,48,2],[36,0,44,0],[36,1,37,1],[36,2,37,2],[38,1,44,1]]}
["長野県の地域活動指針\n [資源向上活動：施設の長寿命化のための活動]"]
[]
["■施設の長寿命化のための活動"]
["対象施設",null,"対象活動",null,"番号"]
["水路\n(開水路)\n(ﾊﾟｲﾌﾟﾗｲﾝ)","水路本体","補修","　水路の破損部分の補修",1,null,null,{"$f":"MATCH(E5,'様式第1-6号'!$AF$13:$AF$600,0)","v":{"$error":"#N/A"}}]
[null,null,null,"　水路の老朽化部分の補修",2,null,null,{"$f":"MATCH(E6,'様式第1-6号'!$AF$13:$AF$600,0)","v":{"$error":"#N/A"}}]
[null,null,null,"　水路側壁の嵩上げ",3,null,null,{"$f":"MATCH(E7,'様式第1-6号'!$AF$13:$AF$600,0)","v":{"$error":"#N/A"}}]
[null,null,null,"　Ｕ字フリューム等既設水路の再布設",4,null,null,{"$f":"MATCH(E8,'様式第1-6号'!$AF$13:$AF$600,0)","v":{"$error":"#N/A"}}]
[null,null,"更新等","　素掘り水路からコンクリート水路への更新",5,null,null,{"$f":"MATCH(E9,'様式第1-6号'!$AF$13:$AF$600,0)","v":{"$error":"#N/A"}}]
[null,null,null,"　水路の更新（一路線全体）",6,null,null,{"$f":"MATCH(E10,'様式第1-6号'!$AF$13:$AF$600,0)","v":{"$error":"#N/A"}}]
[null,"附帯施設","補修","　集水枡、分水枡の補修",7,null,null,{"$f":"MATCH(E11,'様式第1-6号'!$AF$13:$AF$600,0)","v":{"$error":"#N/A"}}]
[null,null,null,"　ゲートの補修",8,null,null,{"$f":"MATCH(E12,'様式第1-6号'!$AF$13:$AF$600,0)","v":{"$error":"#N/A"}}]
[null,null,null,"　ポンプの補修",9,null,null,{"$f":"MATCH(E13,'様式第1-6号'!$AF$13:$AF$600,0)","v":{"$error":"#N/A"}}]
[null,null,null,"　安全施設の補修",10,null,null,{"$f":"MATCH(E14,'様式第1-6号'!$AF$13:$AF$600,0)","v":{"$error":"#N/A"}}]
[null,null,null,"　取水施設の補修　　　　　　　　　　　　　　　＜県追加＞",11,null,null,{"$f":"MATCH(E15,'様式第1-6号'!$AF$13:$AF$600,0)","v":{"$error":"#N/A"}}]
[null,null,null,"　除塵施設（スクリーン等）の補修　　　　　　　＜県追加＞",12,null,null,{"$f":"MATCH(E16,'様式第1-6号'!$AF$13:$AF$600,0)","v":{"$error":"#N/A"}}]
[null,null,null,"　水路法面の補修　　　　　　　　　　　　　　　＜県追加＞",13,null,null,{"$f":"MATCH(E17,'様式第1-6号'!$AF$13:$AF$600,0)","v":{"$error":"#N/A"}}]
[null,null,null,"　空気弁、バルブの補修　　　　　　　　　　　　＜県追加＞",14,null,null,{"$f":"MATCH(E18,'様式第1-6号'!$AF$13:$AF$600,0)","v":{"$error":"#N/A"}}]
[null,null,null,"　制御施設等の補修　　　　　　　　　　　　　　＜県追加＞",15,null,null,{"$f":"MATCH(E19,'様式第1-6号'!$AF$13:$AF$600,0)","v":{"$error":"#N/A"}}]
[null,null,"更新等","　ゲートの更新",16,null,null,{"$f":"MATCH(E20,'様式第1-6号'!$AF$13:$AF$600,0)","v":{"$error":"#N/A"}}]
{"$rows_left_out":33}